{"text_format":"3","workbook":"xlsx","n_sheets":19,"sheets":["Vsl Details","Checklist A","Checklist B","Checklist C","Master Comment","Departure Port Info","Dep Port Safety Setting","Berth to Pilot","Sea Passage Safety Setting","Sea Passage","Arrival Port Info","Arrival Port Safet Setting","Pilot to Berth","Implementation","Appendix Deviation","Amendment to Passage Plan","Post Voyage Review","Emer and Contingency Plan","Sample Emer & Contingency Plan"],"not_rendered":{"images":2,"macros":1,"external_links":1,"defined_names":51},"read":"whole","date_system":"1900"}

{"sheet":"Vsl Details","index":0,"n_rows":44,"n_cols":4,"rows_kept":44,"merged":[[0,0,2,0],[0,2,0,3],[1,2,1,3],[2,2,2,3]]}
["NAV-01",null,"Doc No :  NAV-01"]
[null,"PASSAGE PLAN","Revision: 01                                                              \nDate: 15 Oct 2024"]
[null,null,"Issued by: DPA\n Approved by: MD"]
[]
["Date",null,"2006-02-02"]
[]
["Vessel Name",null,"M/T Example"]
["Call Sign :",null,"GB07"]
{"$rows_left_out":37}
{"sheet":"Checklist A","index":1,"n_rows":56,"n_cols":25,"rows_kept":56,"merged":[[0,0,2,1],[0,2,0,12],[0,13,0,15],[1,2,1,12],[1,13,1,15],[2,2,2,12],[2,13,2,15],[4,3,4,5],[4,6,4,8],[6,0,6,1],[6,14,6,15],[7,6,7,9],[8,6,8,9],[9,6,9,9],[11,7,11,10],[11,17,12,20],[12,1,12,2],[13,0,13,7],[13,10,13,15],[14,0,14,1],[14,2,14,7],[15,0,15,1],[15,2,15,7],[16,0,16,1],[16,2,16,7],[17,0,17,1],[17,2,17,7],[18,0,18,1],[18,2,18,7],[19,0,19,1],[19,2,19,7],[20,0,20,1],[20,2,20,7],[21,0,21,1],[21,2,21,7],[21,12,21,15],[22,0,22,1],[22,2,22,7],[23,0,23,1],[24,0,24,7],[26,0,26,7],[26,9,26,12],[26,14,26,15],[27,1,27,7],[27,14,27,15],[28,1,28,7],[28,14,28,15],[29,1,29,7],[29,14,29,15],[30,1,30,7],[30,14,30,15],[31,1,31,7],[31,14,31,15],[32,1,32,7],[32,14,32,15],[33,1,33,7],[33,14,33,15],[34,1,34,6],[36,2,36,5],[36,6,36,15],[37,2,37,5],[37,6,37,15],[38,2,38,5],[38,6,38,15],[39,2,39,5],[39,6,39,15],[43,0,43,15],[44,0,44,15],[45,0,45,15],[46,0,46,15],[47,0,47,15],[48,14,48,15],[50,1,50,15]]}
["NAV-01",{"$nulls":12},"Doc No :  NAV-01"]
[null,null,"PASSAGE PLAN",{"$nulls":10},"Revision: 01                                                              \nDate: 15 Oct 2024"]
[{"$nulls":13},"Issued by: DPA\n Approved by: MD"]
[]
["Date :",{"$f":"'Vsl Details'!C5","v":"2006-02-02"},null,"Vessel Name :",null,null,{"$f":"'Vsl Details'!C7","v":"M/T Example"},{"$nulls":7},"Voyage No :",{"$f":"'Vsl Details'!C9","v":11}]
[]
["Draft",{"$nulls":5},"Port",{"$nulls":3},"Berth",{"$nulls":3},"Time"]
["Fwd :",{"$f":"'Vsl Details'!C23","v":{"v":11,"d":"11.00 m"}},{"$nulls":3},"From :",{"$f":"IF('Vsl Details'!C12=\"\",\"\",'Vsl Details'!C12)","v":"Singapore"},{"$nulls":3},{"$f":"IF('Vsl Details'!C13=\"\",\"\",'Vsl Details'!C13)","v":""},{"$nulls":3},"GMT :",{"$f":"'Vsl Details'!C14","v":8}]
{"$rows_left_out":49}
{"sheet":"Checklist B","index":2,"n_rows":60,"n_cols":5,"rows_kept":60,"merged":[[0,0,2,0],[0,1,0,3],[1,1,1,3],[2,1,2,3],[5,0,5,4],[6,0,6,4],[11,0,11,4],[18,0,18,4],[19,0,19,3],[22,0,22,4],[23,1,23,4],[24,1,24,4],[25,1,25,4],[26,1,26,4],[27,1,27,4],[28,0,28,4],[32,1,32,4],[33,0,33,4],[37,1,37,2],[39,1,39,2],[41,1,41,2],[43,1,43,2],[44,1,44,2],[45,0,45,4],[46,1,46,4],[47,1,47,4],[48,1,48,4],[49,1,49,4],[51,1,51,4],[52,1,52,4],[53,1,53,4],[54,1,54,4],[55,1,55,4],[56,1,56,4],[58,0,58,4],[59,0,59,4]]}
["NAV-01",{"$nulls":3},"Doc No :  NAV-01"]
[null,"PASSAGE PLAN",null,null,"Revision: 01                                                              \nDate: 15 Oct 2024"]
[{"$nulls":4},"Issued by: DPA\nApproved by: MD"]
[]
["Passage Plan Appraisal & Checklist"]
["Appraisal & planning of passage to be done using information from relevant sources. Suggested sources are listed below. Click mouse on item to place Ö in boxes to left of items used in appraisal and planning."]
["Have the navigation charts been selected from chart catalogue, including"]
[null,"Large scale charts for coastal waters",null,null,"Planning Charts"]
{"$rows_left_out":53}
{"sheet":"Checklist C","index":3,"n_rows":70,"n_cols":13,"rows_kept":70,"merged":[[2,0,2,12],[3,8,3,10],[4,0,4,9],[5,1,5,9],[6,1,6,9],[7,1,7,9],[8,1,8,9],[9,1,9,9],[10,1,10,9],[11,1,11,9],[12,1,12,9],[13,1,13,9],[14,1,14,9],[15,1,15,9],[16,1,16,9],[17,1,17,9],[18,1,18,9],[19,1,19,9],[20,1,20,9],[21,1,21,9],[22,1,22,9],[23,1,23,9],[24,1,24,9],[25,1,25,9],[26,1,26,9],[27,1,27,9],[28,1,28,9],[29,1,29,9],[30,0,30,9],[31,0,37,0],[31,1,31,9],[32,1,32,9],[33,1,33,9],[34,1,34,9],[35,1,35,9],[36,1,36,9],[37,1,37,9],[42,0,42,9],[43,0,67,0],[43,1,43,9],[44,1,44,9],[45,1,45,9],[46,1,46,9],[47,1,47,9],[48,1,48,9],[49,1,49,9],[50,1,50,9],[51,1,51,9],[52,1,52,9],[53,1,53,9],[54,1,54,9],[55,1,55,9],[56,1,56,9],[57,1,57,12],[58,1,58,9],[59,1,59,9],[60,1,60,9],[61,1,61,9],[62,1,62,9],[63,1,63,9],[64,1,64,9],[65,1,65,9],[66,1,66,9],[67,1,67,9],[68,0,68,12],[69,0,69,2],[69,3,69,5],[69,6,69,8],[69,9,69,12],[70,0,71,2],[70,3,71,5],[70,6,71,8],[70,9,71,12],[72,1,72,9],[73,10,73,12]]}
[]
[]
["ECDIS - Voyage Plan - Checklist  - (To be used for vessels fitted with ECDIS) "]
["Voyage From: ",{"$nulls":3},"To:"]
[{"$nulls":10},"Yes","No ","N/A"]
[null,"General"]
[1,"S57 ENC Charts with Permit for the entire voyage available in the ECDIS Catalogue & installed? "]
[2,"S57 ENC Charts updated with latest Base and Update CDs? "]
{"$rows_left_out":63}
{"sheet":"Master Comment","index":4,"n_rows":50,"n_cols":1,"rows_kept":50,"merged":[[2,0,2,8],[3,0,19,8],[20,0,21,8],[22,0,22,8],[23,0,46,8]]}
[]
["Additional Remarks "]
["( Please enter remarks regarding anticipated Ocean currents, Visibility & Other Meterological Conditions; Areas of high traffic density ; Ship operations which may require additional searoom e.g tank cleaning or pilot embarkation ; the availability and reliability of navigation aids, marks lights and radar consipicous objects etc )"]
{"$rows_empty":17}
["Master's Comments (navigation related instructions in the charterers voyage orders / past experience etc.)"]
[]
["Ensure that the post voyage review is completed under the dedicated tab after the voyage is completed. "]
{"$rows_empty":25}
{"$rows_left_out":3}
{"sheet":"Departure Port Info","index":5,"n_rows":31,"n_cols":4,"rows_kept":31,"merged":[[1,3,1,4],[2,0,2,4],[9,0,9,4],[17,0,17,4],[27,1,27,4],[29,0,29,4],[31,0,31,4]]}
[]
[]
["PORT OF DEPARTURE INFORMATION"]
["Passage Plan Name on ECDIS"]
["User Chart name on ECDIS"]
["Name of Departure Berth"]
["VHF Channel(s) - Port Control"]
["VHF Channel(s) - VTS"]
{"$rows_left_out":24}
{"sheet":"Dep Port Safety Setting","index":6,"n_rows":31,"n_cols":8,"rows_kept":31,"merged":[[0,0,0,4],[1,3,1,4],[16,0,16,4],[17,0,17,4],[18,0,18,4],[19,0,19,4],[20,0,20,4],[21,0,21,4],[22,0,22,4],[23,0,23,4],[24,0,24,4],[26,1,26,3],[27,1,27,3],[28,1,29,3],[30,1,30,3]]}
["Safety Setting Departure Port"]
["Beam:",32,"Cb:",0.7786]
["AREA","Ocean Passage (Open)","Fairways outside ports (Coastal / Shallow waters)","Fairways inside ports (Within Port Limits / Restricted Waters)","Remarks"]
["MAX. SPEED",{"v":12.5,"d":"12.50"},{"v":12.5,"d":"12.50"},{"v":5,"d":"5.00"}]
["DEEPEST DRAFT",9.85,9.85,9.85,"Static Draft"]
["TOTAL CALCULATED SQUAT",{"v":1.5,"d":"1.50"},{"v":1.5,"d":"1.50"},{"v":0.4,"d":"0.40"}]
["SAFETY MARGIN",{"v":2,"d":"2.00"},{"v":0.5,"d":"0.50"},{"v":0.4,"d":"0.40"},"Ensure it is equal to A3 in NAV 02 (Catzoc Consideration Tab)."]
["MINIMUM UKC REQUIRED",{"$f":"(B5+B6+B7)/2","v":{"v":6.675,"d":"6.68"}},{"$f":"(C5+C6+C7)*0.15","v":{"v":1.7774999999999999,"d":"1.78"}},{"$f":"IF(F8>G8,F8,G8)","v":{"v":0.6,"d":"0.60"}},null,{"$f":"B2*0.015","v":0.48},0.6]
{"$rows_left_out":24}
{"sheet":"Berth to Pilot","index":7,"n_rows":40,"n_cols":87,"rows_kept":40,"merged":[[2,1,2,2],[3,7,3,9],[4,1,4,2],[4,6,4,9],[4,12,4,14],[5,7,5,12],[6,0,8,0],[6,1,8,1],[6,2,7,4],[6,5,7,7],[6,8,8,8],[6,9,8,9],[6,10,8,10],[6,11,8,11],[6,12,7,15],[6,16,8,16],[6,17,8,17],[6,18,8,18],[6,19,8,19],[6,20,7,20],[6,21,8,21],[6,22,8,22],[6,23,7,24],[39,5,39,7]]}
[]
[]
[null,"All dates & times are GMT",{"$nulls":9},{"$f":"+'Vsl Details'!C7","v":"M/T Example"}]
[null,"PILOTS",null,"SPD"," ","Voy :",{"$f":"+'Vsl Details'!C9","v":11},{"$f":"+'Vsl Details'!C10","v":"Loaded"},null,null,"Time"]
[null,"2005-07-22T12:00:00",null,14.3," ","From :",{"$f":"'Checklist A'!$G$8","v":"Singapore"},{"$nulls":3},{"$f":"+'Vsl Details'!C14","v":{"v":8,"d":" 8"}},"To :",{"$f":"'Checklist A'!$G$9","v":"Rotterdam"},null,null,{"$f":"+'Vsl Details'!C18","v":{"v":1,"d":" 1"}},{"$nulls":6},"Berth to Pilot"]
[{"$nulls":3}," "," "," "]
["WP No.","GEOGRAPHICAL AREA WAYPOINT","LATITUDE",null,null,"LONGITUDE",null,null,"CO","DIST. TO NEXT WP","DTG","RL/GC","Verification Freq / Method",{"$nulls":3},"Max Spd (kts)","T&P Notices","Safety Setting","UKC","MARPOL Special area / ECA Zone","Security Level","Remarks: NAV Aids, Restrictions, Weather, Cautions, Traffic Density, UKC, Tides etc, T&P notice number effecting each leg, extra lookout if passing through HRA, Area where vessel should be hardened.","Watch Level"]
[{"$nulls":26},"latrad","longrad","dlon_W","dlon_E","dphi","q1","q","dlon_min","tc_rad","tc","dist_rad","dist",{"$nulls":30},"Yes"]
{"$rows_left_out":33}
{"sheet":"Sea Passage Safety Setting","index":8,"n_rows":31,"n_cols":8,"rows_kept":31,"merged":[[0,0,0,4],[1,3,1,4],[16,0,16,4],[17,0,17,4],[18,0,18,4],[19,0,19,4],[20,0,20,4],[21,0,21,4],[22,0,22,4],[23,0,23,4],[24,0,24,4],[26,1,26,3],[27,1,27,3],[28,1,29,3],[30,1,30,3]]}
["Safety Setting Sea Passage"]
["Beam:",32,"Cb:",0.7786]
["AREA","Ocean Passage (Open)","Fairways outside ports (Coastal / Shallow waters)","Fairways inside ports (Within Port Limits / Restricted Waters)","Remarks"]
["MAX. SPEED",{"v":12.5,"d":"12.50"},{"v":12.5,"d":"12.50"},{"v":6,"d":"6.00"}]
["DEEPEST DRAFT",{"v":20,"d":"20.00"},{"v":4.9,"d":"4.90"},{"v":19.8,"d":"19.80"},"Static Draft"]
["TOTAL CALCULATED SQUAT",1.25,1.16,0.56]
["SAFETY MARGIN",{"v":2,"d":"2.00"},{"v":2,"d":"2.00"},1.42,"Ensure it is equal to A3 in NAV 02 (Catzoc Consideration Tab)."]
["MINIMUM UKC REQUIRED",{"$f":"(B5+B6+B7)/2","v":{"v":11.625,"d":"11.63"}},{"$f":"(C5+C6+C7)*0.15","v":{"v":1.209,"d":"1.21"}},{"$f":"IF(F8>G8,F8,G8)","v":{"v":0.6,"d":"0.60"}},null,{"$f":"B2*0.015","v":0.48},0.6]
{"$rows_left_out":24}
{"sheet":"Sea Passage","index":9,"n_rows":109,"n_cols":87,"rows_kept":109,"merged":[[2,1,2,2],[3,7,3,9],[4,1,4,2],[4,6,4,9],[4,12,4,14],[5,7,5,12],[6,0,8,0],[6,1,8,1],[6,2,7,4],[6,5,7,7],[6,8,8,8],[6,9,8,9],[6,10,8,10],[6,11,8,11],[6,12,7,15],[6,16,8,16],[6,17,8,17],[6,18,8,18],[6,19,8,19],[6,20,7,20],[6,21,8,21],[6,22,8,22],[6,23,7,24],[108,5,108,7]]}
[]
[{"$nulls":16},"`"]
[null,"All dates & times are GMT",{"$nulls":9},{"$f":"+'Vsl Details'!C7","v":"M/T Example"}]
[null,"PILOTS",null,"SPD"," ","Voy :",{"$f":"+'Vsl Details'!C9","v":11},{"$f":"+'Vsl Details'!C10","v":"Loaded"},null,null,"Time",{"$nulls":11},{"$f":"SUM(J10:J108)","v":{"v":16016.103436472162,"d":"Total Distance : 16016.1"}}]
[null,"2005-07-22T12:00:00",null,14.3," ","From :",{"$f":"'Checklist A'!$G$8","v":"Singapore"},{"$nulls":3},{"$f":"+'Vsl Details'!C14","v":{"v":8,"d":" 8"}},"To :",{"$f":"'Checklist A'!$G$9","v":"Rotterdam"},null,null,{"$f":"+'Vsl Details'!C18","v":{"v":1,"d":" 1"}},{"$nulls":6},"Sea Passage"]
[{"$nulls":3}," "," "," "]
["WP No.","GEOGRAPHICAL AREA WAYPOINT","LATITUDE",null,null,"LONGITUDE",null,null,"CO","DIST. TO NEXT WP","DTG","RL/GC","Verification Freq / Method",{"$nulls":3},"Max Spd (kts)","T&P Notices","Safety Setting","UKC","MARPOL Special area / ECA Zone","Security Level","Remarks: NAV Aids, Restrictions, Weather, Cautions, Traffic Density, UKC, Tides etc, T&P notice number effecting each leg, extra lookout if passing through HRA, Area where vessel should be hardened.","Watch Level",{"$nulls":24},"Ocean Passage (Open)","Fairways outside ports (Coastal / Shallow waters)","Fairways inside ports (Within Port Limits / Restricted Waters)"]
[{"$nulls":26},"latrad","longrad","dlon_W","dlon_E","dphi","q1","q","dlon_min","tc_rad","tc","dist_rad","dist"]
{"$rows_left_out":102}
{"sheet":"Arrival Port Info","index":10,"n_rows":31,"n_cols":4,"rows_kept":31,"merged":[[1,3,1,4],[2,0,2,4],[9,0,9,4],[17,0,17,4],[27,1,27,4],[29,0,29,4],[31,0,31,4]]}
[]
[]
["PORT OF ARRIVAL INFORMATION"]
["Passage Plan Name on ECDIS"]
["User Chart Name on ECDIS"]
["Name of Arrival Berth"]
["VHF Channel(s) - Port Control"]
["VHF Channel(s) - VTS"]
{"$rows_left_out":24}
{"sheet":"Arrival Port Safet Setting","index":11,"n_rows":31,"n_cols":8,"rows_kept":31,"merged":[[0,0,0,4],[1,3,1,4],[16,0,16,4],[17,0,17,4],[18,0,18,4],[19,0,19,4],[20,0,20,4],[21,0,21,4],[22,0,22,4],[23,0,23,4],[24,0,24,4],[26,1,26,3],[27,1,27,3],[28,1,29,3],[30,1,30,3]]}
["Safety Setting Arrival Port"]
["Beam:",32,"Cb:",0.7786]
["AREA","Ocean Passage (Open)","Fairways outside ports (Coastal / Shallow waters)","Fairways inside ports (Within Port Limits / Restricted Waters)","Remarks"]
["MAX. SPEED",{"v":12.5,"d":"12.50"},{"v":12.5,"d":"12.50"},{"v":6,"d":"6.00"}]
["DEEPEST DRAFT",{"v":10,"d":"10.00"},{"v":4.9,"d":"4.90"},{"v":19.8,"d":"19.80"},"Static Draft"]
["TOTAL CALCULATED SQUAT",{"v":2,"d":"2.00"},1.16,0.56]
["SAFETY MARGIN",{"v":2,"d":"2.00"},{"v":2,"d":"2.00"},1.42,"Ensure it is equal to A3 in NAV 02 (Catzoc Consideration Tab)."]
["MINIMUM UKC REQUIRED",{"$f":"(B5+B6+B7)/2","v":{"v":7,"d":"7.00"}},{"$f":"(C5+C6+C7)*0.15","v":{"v":1.209,"d":"1.21"}},{"$f":"IF(F8>G8,F8,G8)","v":{"v":0.6,"d":"0.60"}},null,{"$f":"B2*0.015","v":0.48},0.6]
{"$rows_left_out":24}
{"sheet":"Pilot to Berth","index":12,"n_rows":40,"n_cols":87,"rows_kept":40,"merged":[[2,1,2,2],[3,7,3,9],[4,1,4,2],[4,6,4,9],[4,12,4,14],[5,7,5,12],[6,0,8,0],[6,1,8,1],[6,2,7,4],[6,5,7,7],[6,8,8,8],[6,9,8,9],[6,10,8,10],[6,11,8,11],[6,12,7,15],[6,16,8,16],[6,17,8,17],[6,18,8,18],[6,19,8,19],[6,20,7,20],[6,21,8,21],[6,22,8,22],[6,23,7,24],[39,5,39,7]]}
[]
[]
[null,"All dates & times are GMT",{"$nulls":9},{"$f":"+'Vsl Details'!C7","v":"M/T Example"}]
[null,"PILOTS",null,"SPD"," ","Voy :",{"$f":"+'Vsl Details'!C9","v":11},{"$f":"+'Vsl Details'!C10","v":"Loaded"},null,null,"Time",{"$nulls":34},"Yes"]
[null,"2005-07-22T12:00:00",null,14.3," ","From :",{"$f":"'Checklist A'!$G$8","v":"Singapore"},{"$nulls":3},{"$f":"+'Vsl Details'!C14","v":{"v":8,"d":" 8"}},"To :",{"$f":"'Checklist A'!$G$9","v":"Rotterdam"},null,null,{"$f":"+'Vsl Details'!C18","v":{"v":1,"d":" 1"}},{"$nulls":6},"Pilot to Berth",{"$nulls":22},"No"]
[{"$nulls":3}," "," "," ",{"$nulls":39},"Level 1"]
["WP No.","GEOGRAPHICAL AREA WAYPOINT","LATITUDE",null,null,"LONGITUDE",null,null,"CO","DIST. TO NEXT WP","DTG","RL/GC","Verification Freq / Method",{"$nulls":3},"Max Spd (kts)","T&P Notices","Safety Setting","UKC","MARPOL Special area / ECA Zone","Security Level","Remarks: NAV Aids, Restrictions, Weather, Cautions, Traffic Density, UKC, Tides etc, T&P notice number effecting each leg, extra lookout if passing through HRA, Area where vessel should be hardened.","Watch Level",{"$nulls":21},"Level 2"]
[{"$nulls":26},"latrad","longrad","dlon_W","dlon_E","dphi","q1","q","dlon_min","tc_rad","tc","dist_rad","dist",{"$nulls":7},"Level 3"]
{"$rows_left_out":33}
{"sheet":"Implementation","index":13,"n_rows":51,"n_cols":13,"rows_kept":51,"merged":[[2,3,4,4],[2,5,2,7],[2,8,2,9],[3,5,3,7],[3,8,3,9],[4,5,4,7],[4,8,4,9],[7,0,7,12]]}
[]
[]
[{"$nulls":3},"NAV-01",{"$nulls":4},"Doc No :  NAV-01"]
[{"$nulls":5},"PASSAGE PLAN",null,null,"Revision: 01                                                              \nDate: 15 Oct 2024"]
[{"$nulls":8},"Issued by: DPA\nApproved by: MD"]
[]
[]
["To be filled by the Duty Officer in whose watch the next Voyage Chart is to be used"]
{"$rows_left_out":44}
{"sheet":"Appendix Deviation","index":14,"n_rows":40,"n_cols":86,"rows_kept":40,"merged":[[2,1,2,2],[3,7,3,9],[4,1,4,2],[4,6,4,9],[4,12,4,14],[5,7,5,12],[6,0,8,0],[6,1,8,1],[6,2,7,4],[6,5,7,7],[6,8,8,8],[6,9,8,9],[6,10,8,10],[6,11,8,11],[6,12,7,15],[6,16,8,16],[6,17,8,17],[6,18,8,18],[6,19,8,19],[6,20,7,20],[6,21,8,21],[6,22,8,22],[6,23,8,23],[39,5,39,7]]}
[]
[]
[null,"All dates & times are GMT",{"$nulls":9},{"$f":"+'Vsl Details'!C7","v":"M/T Example"}]
[null,"PILOTS",null,"SPD"," ","Voy :",{"$f":"+'Vsl Details'!C9","v":11},{"$f":"+'Vsl Details'!C10","v":"Loaded"},null,null,"Time",{"$nulls":33},"Yes"]
[null,"2005-07-22T12:00:00",null,14.3," ","From :",{"$f":"'Checklist A'!$G$8","v":"Singapore"},{"$nulls":3},{"$f":"+'Vsl Details'!C14","v":{"v":8,"d":" 8"}},"To :",{"$f":"'Checklist A'!$G$9","v":"Rotterdam"},null,null,{"$f":"+'Vsl Details'!C18","v":{"v":1,"d":" 1"}},{"$nulls":6},"Appendix - Deviation",{"$nulls":21},"No"]
[{"$nulls":3}," "," "," ",{"$nulls":38},"Level 1"]
["WP No.","GEOGRAPHICAL AREA WAYPOINT","LATITUDE",null,null,"LONGITUDE",null,null,"CO","DIST. TO NEXT WP","DTG","RL/GC","Verification Freq / Method",{"$nulls":3},"Max Spd","T&P Notices","Safety Setting","UKC","MARPOL Special area / ECA Zone","Security Level","Remarks: NAV Aids, Restrictions, Weather, Cautions, Traffic Density, UKC, Tides etc, T&P notice number effecting each leg, extra lookout if passing through HRA, Area where vessel should be hardened.","Watch Level",{"$nulls":20},"Level 2"]
[{"$nulls":25},"latrad","longrad","dlon_W","dlon_E","dphi","q1","q","dlon_min","tc_rad","tc","dist_rad","dist",{"$nulls":7},"Level 3"]
{"$rows_left_out":33}
{"sheet":"Amendment to Passage Plan","index":15,"n_rows":20,"n_cols":4,"rows_kept":20,"merged":[[1,0,1,4],[2,1,2,2],[3,1,3,2],[4,1,4,2],[6,1,6,2],[10,1,10,2],[12,0,12,4],[13,0,13,4],[14,0,14,4],[15,0,15,4],[16,0,16,4],[17,0,17,4],[18,0,18,4],[19,1,19,4]]}
[]
["Amendment to Passage Plan"]
["Amendment No",null,null,"Voyage:"]
["Amendment Commenced (Date and Time (LT/UTC))",null,null,"Amendment Completed \n(Date and Time (LT/UTC)) "]
["Amendment of Passage \nStarted at Position  ",null,null,"Amendment of Passage \nCompleted at Position "]
["Reasons for Amendment of Passage"]
["Additional ENC’s  ",null,null,"Additional Publications "]
[null,"UKC for new route calculated ",null,"New UKC:"]
{"$rows_left_out":13}
{"sheet":"Post Voyage Review","index":16,"n_rows":47,"n_cols":8,"rows_kept":47,"merged":[[0,0,2,1],[0,2,0,6],[0,7,0,8],[1,2,1,6],[1,7,1,8],[2,2,2,6],[2,7,2,8],[4,0,4,8],[10,0,10,5],[23,0,24,8],[25,0,42,8]]}
["NAV-01",{"$nulls":6},"Doc No :  NAV-01"]
[null,null,"POST VOYAGE REVIEW",{"$nulls":4},"Revision: 01                                                              \nDate: 15 Oct 2024"]
[{"$nulls":7},"Issued by: DPA\nApproved by: MD"]
["Post Voyage review to be carried out by the Master with Bridge Team"]
["(Post-voyage review to be carried out after every voyage to check if any new hazards or useful information discovered, for incorporation in the future passage plan) "]
["Points to consider:"]
["1. Any amendment to the waypoints"]
["2. Appropriateness of charts and publications."]
{"$rows_left_out":9}
{"sheet":"Emer and Contingency Plan","index":17,"n_rows":32,"n_cols":8,"rows_kept":32,"merged":[[0,0,0,12],[2,0,2,12],[3,0,3,12],[5,1,5,3],[5,4,5,6],[5,7,5,12],[6,0,8,0],[6,1,8,3],[6,4,8,6],[6,7,6,12],[7,7,7,12],[8,7,8,12],[9,0,10,0],[9,1,10,3],[9,4,10,6],[9,7,9,12],[10,7,10,12],[11,0,16,0],[11,1,16,3],[11,4,11,6],[11,7,11,12],[12,4,12,6],[12,7,12,12],[13,4,13,6],[13,7,13,12],[14,4,16,6],[14,7,14,12],[15,7,15,12],[16,7,16,12],[17,0,18,0],[17,1,18,3],[17,4,18,6],[17,7,17,12],[18,7,18,12],[19,0,20,0],[19,1,20,3],[19,4,20,6],[19,7,19,12],[20,7,20,12],[21,0,22,0],[21,1,22,3],[21,4,22,6],[21,7,21,12],[22,7,22,12],[23,0,24,0],[23,1,24,3],[23,4,24,6],[23,7,23,12],[24,7,24,12],[25,0,26,0],[25,1,26,3],[25,4,26,6],[25,7,25,12],[26,7,26,12],[31,0,31,12]]}
[]
[]
["Emergency and Contingency Plan"]
["Vessel should prepare a separate HSSEQ-18 (Risk Assessment) if required."]
[]
["No","Hazard",null,null,"Risk",null,null,"Contingency Plan / Control Measures"]
[1,"Loss of Propulsion or Steering Failure",null,null,"Collision or Grounding"]
[]
{"$rows_left_out":25}
{"sheet":"Sample Emer & Contingency Plan","index":18,"n_rows":33,"n_cols":8,"rows_kept":33,"merged":[[9,0,9,12],[10,0,10,12],[11,0,11,12],[13,1,13,3],[13,4,13,6],[13,7,13,12],[14,0,16,0],[14,1,16,3],[14,4,16,6],[14,7,14,12],[15,7,15,12],[16,7,16,12],[17,0,18,0],[17,1,18,3],[17,4,18,6],[17,7,17,12],[18,7,18,12],[19,0,24,0],[19,1,24,3],[19,4,19,6],[19,7,19,12],[20,4,20,6],[20,7,20,12],[21,4,21,6],[21,7,21,12],[22,4,24,6],[22,7,22,12],[23,7,23,12],[24,7,24,12],[25,0,26,0],[25,1,26,3],[25,4,26,6],[25,7,25,12],[26,7,26,12],[27,0,28,0],[27,1,28,3],[27,4,28,6],[27,7,27,12],[28,7,28,12],[29,0,30,0],[29,1,30,3],[29,4,30,6],[29,7,30,12],[31,0,32,0],[31,1,32,3],[31,4,32,6],[31,7,31,12],[32,7,32,12],[33,0,34,0],[33,1,34,3],[33,4,34,6],[33,7,33,12],[34,7,34,12]]}
{"$rows_empty":9}
["Emergency and Contingency Plan "]
["Below if for guidance only, vessel should prepare passage specific plan.                                                                                  "]
["Vessel should prepare a separate HSSEQ-18 (Risk Assessment) if required."]
[" "]
["No","Emergency Situation",null,null,"Likely consequence ",null,null,"Contingency Plan / Control Measures"]
[1,"Loss of Propulsion or Steering Failure",null,null,"Collision or Grounding",null,null,"WPT 1 to 4: There is no emergency anchorage in this area. In case of emergency, drop anchor in the channel and call for tug assistance."]
[{"$nulls":7},"WPT 5 to 7: Anchor at contingency anchorage in position 03 35N 041 22E"]
{"$rows_left_out":17}